News
Arduino: 1.8.13 (Windows 10), Board: "Arduino Uno" avr-gcc: error: @C:\Windows\TEMP\cceNc5Ku: Invalid argument avr-gcc: fatal error: no input files compilation terminated. lto-wrapper.exe: fatal error ...
Is your feature request related to a problem? Please describe. While compiling a file without selecting any board we get compile time error, So either the error should be meaningful like "SELECT BOARD ...
[psgarcha] took a year-old Arduino Uno on an international trip and upon returning found something was wrong. Every time he would try to upload, he would get the dreaded avrdude error, ‘stk500 ...
Some results have been hidden because they may be inaccessible to you
Show inaccessible results